{"text_format":"1","workbook":"xlsx","n_sheets":3,"sheets":["Kjøreplan","Input","Erik Arbeidsark"],"not_rendered":{"charts":0,"images":0,"macros":1,"external_links":0,"defined_names":4,"comments":0,"pivot_tables":0},"unopened":[],"bounds":{"document_bytes":16777216,"sheet_cells":100000,"rows_first":2000,"rows_last":500,"rows_between":2000,"halvings":0,"cell_chars":16384,"cell_head_chars":4096},"cells_cut":0,"cells_raw":0,"read":"whole","date_system":"1900"}

{"sheet":"Kjøreplan","index":0,"n_rows":160,"n_cols":10,"rows_kept":160,"cut":false,"hidden":false,"merged":[[0,2,0,3],[0,4,0,5],[0,7,0,8]]}
["Mnd","Kjøring","Når DFØ registrerer manuelle bilag eller skal lese inn transaksjoner fra fil, må bilaget/fila  være mottatt av DFØ senest  dato i denne kolonnen.",null,"Registrering - og godkjenningsfrist for godkjenner2 ",null,"Kontrollperiode lønn og reise/ Tidligste kjøredato andre kjøringer","Siste frist for å ha avsluttet  kjøringen",null,"Utbetalings-dato"]
[{"$f":"IF(I2=\"\",\"\",PROPER(TEXT(I2,\"mmm\")))","v":"Jan"},"A-meldingen",{"$f":"IF(D2=\"\",\"\",IFERROR(VLOOKUP(D2,Helligdager_tabell,2,0),TEXT(D2,\"dddd\")))","v":""},"",{"$f":"IF(F2=\"\",\"\",TEXT(F2,\"dddd\"))","v":""},"",null,{"$f":"IFERROR(VLOOKUP(I2,Helligdager_tabell,2,0),TEXT(I2,\"dddd\"))","v":"tirsdag"},"2021-01-05",{"$f":"IF(OR(LEFT($B2,5)=\"HOVED\",LEFT($B2,5)=\"13. k\"),WORKDAY(I2,3,Helligdager),IF(OR(LEFT($B2,5)=\"Reise\",LEFT($B2,5)=\"Bonus\",LEFT($B2,5)=\"2-mån\",LEFT($B2,5)=\"1-mån\"),WORKDAY(I2,2,Helligdager),\"\"))","v":""}]
["Jan","Innlesing av oppgjørsrapport fra NAV","","","","","02.01*","torsdag","2021-01-07",""]
["Jan","HOVEDLØNN","fredag","2020-12-18","mandag","2021-01-04T20:00:00","05.01 kl 12.00 - 06.01 kl 20.00         For fullservice 06.01 kl 12.00","torsdag","2021-01-07","2021-01-12"]
["Jan","Reisekjøring (alle kunder)","mandag","2021-01-04","torsdag","2021-01-07T20:00:00",{"$f":"TEXT(I5,\"dd.mm\")&\" kl 10:00 - 12:00\"","v":"08.01 kl 10:00 - 12:00"},"fredag","2021-01-08","2021-01-13"]
["Jan","2-månedsoppgjør (T2)","","","","","04.01*","onsdag","2021-01-13","2021-01-15"]
["Jan","Bonuslønn","fredag","2021-01-08","onsdag","2021-01-13T20:00:00",{"$f":"TEXT(I7,\"dd.mm\")&\" kl 10:00 - 12:00\"","v":"14.01 kl 10:00 - 12:00"},"torsdag","2021-01-14","2021-01-18"]
["Jan","Reisekjøring (ekstrakjøring)","mandag","2021-01-11","torsdag","2021-01-14T20:00:00","15.01 kl 10:00 - 12:00","fredag","2021-01-15",{"$f":"IF(OR(LEFT($B8,5)=\"HOVED\",LEFT($B8,5)=\"13. k\"),WORKDAY(I8,3,Helligdager),IF(OR(LEFT($B8,5)=\"Reise\",LEFT($B8,5)=\"Bonus\",LEFT($B8,5)=\"2-mån\",LEFT($B8,5)=\"1-mån\"),WORKDAY(I8,2,Helligdager),\"\"))","v":"2021-01-19"}]
["Jan","1-månedsoppgjør (T1)","","","","","09.01*","mandag","2021-01-18","2021-01-20"]
["Jan","Reisekjøring (ekstrakjøring)","onsdag","2021-01-13","mandag","2021-01-18T20:00:00",{"$f":"TEXT(I10,\"dd.mm\")&\" kl 10:00 - 12:00\"","v":"19.01 kl 10:00 - 12:00"},"tirsdag","2021-01-19","2021-01-21"]
["Jan","Bonuslønn","onsdag","2021-01-20","mandag","2021-01-25T20:00:00","26.01 kl 10:00 - 12:00","tirsdag","2021-01-26","2021-01-28"]
["Jan","Innlesing tidfiler","torsdag","2021-01-21","","",null,"onsdag","2021-01-27",""]
["Jan","Reisekjøring (alle kunder)","torsdag","2021-01-21","tirsdag","2021-01-26T20:00:00",{"$f":"TEXT(I13,\"dd.mm\")&\" kl 10:00 - 12:00\"","v":"27.01 kl 10:00 - 12:00"},"onsdag","2021-01-27","2021-01-29"]
["Jan","SPK inneværende mnd","","","","","07.01*","fredag","2021-01-29",""]
["Feb","Kontrolliste for pensjonsgivende tillegg","","","","","07.01.* ","torsdag","2021-02-04",""]
["Feb","A-meldingen","","","","",null,"fredag","2021-02-05",""]
["Feb","Innlesing av oppgjørsrapport fra NAV","","","","","01.02*","mandag","2021-02-08",""]
["Feb","HOVEDLØNN","torsdag","2021-01-28","torsdag","2021-02-04T20:00:00","05.02 kl 12.00 - 08.02 kl 20.00                            For fullservice:  08.02 kl 12.00","tirsdag","2021-02-09","2021-02-12"]
["Feb","Reisekjøring (alle kunder)","fredag","2021-02-05","onsdag","2021-02-10T20:00:00",{"$f":"TEXT(I19,\"dd.mm\")&\" kl 10:00 - 12:00\"","v":"11.02 kl 10:00 - 12:00"},"torsdag","2021-02-11","2021-02-15"]
["Feb","Bonuslønn","mandag","2021-02-08","torsdag","2021-02-11T20:00:00","12.02 kl 10:00 - 12:00","fredag","2021-02-12","2021-02-16"]
["Feb","Reisekjøring (ekstrakjøring)","onsdag","2021-02-10","mandag","2021-02-15T20:00:00","16.02 kl 10:00 - 12:00","tirsdag","2021-02-16","2021-02-18"]
["Feb","1-månedsoppgjør (T1)","","","","","10.02*","torsdag","2021-02-18","2021-02-22"]
["Feb","Reisekjøring (ekstrakjøring)","mandag","2021-02-15","torsdag","2021-02-18T20:00:00",{"$f":"TEXT(I23,\"dd.mm\")&\" kl 10:00 - 12:00\"","v":"19.02 kl 10:00 - 12:00"},"fredag","2021-02-19","2021-02-23"]
["Feb","Bonuslønn","onsdag","2021-02-17","mandag","2021-02-22T20:00:00","23.02 kl 10:00 - 12:00","tirsdag","2021-02-23","2021-02-25"]
["Feb","Reisekjøring (alle kunder)","torsdag","2021-02-18","tirsdag","2021-02-23T20:00:00","24.02 kl 10:00 - 12:00","onsdag","2021-02-24","2021-02-26"]
["Feb","Innlesing tidfiler","fredag","2021-02-19","","",null,"torsdag","2021-02-25",""]
["Feb","SPK inneværende mnd","","","","","09.02*","fredag","2021-02-26",""]
["Mar","A-meldingen","","","","",null,"fredag","2021-03-05",""]
["Mar","Innlesing av oppgjørsrapport fra NAV","","","","","03.03*","mandag","2021-03-08",""]
["Mar","HOVEDLØNN","torsdag","2021-02-25","torsdag","2021-03-04T20:00:00","05.03 kl 12.00 - 08.03 kl 20.00                            For fullservice til  08.03 kl 12.00","tirsdag","2021-03-09","2021-03-12"]
["Mar","Reisekjøring (alle kunder)","torsdag","2021-03-04","tirsdag","2021-03-09T20:00:00",{"$f":"TEXT(I31,\"dd.mm\")&\" kl 10:00 - 12:00\"","v":"10.03 kl 10:00 - 12:00"},"onsdag","2021-03-10","2021-03-16"]
["Mar","Bonuslønn","fredag","2021-03-05","onsdag","2021-03-10T20:00:00","11.03 kl 10:00 - 12:00","torsdag","2021-03-11","2021-03-17"]
["Mar","2-månedsoppgjør (T2)","","","","","01.03*","fredag","2021-03-12","2021-03-15"]
[{"$f":"IF(I34=\"\",\"\",PROPER(TEXT(I34,\"mmm\")))","v":"Mar"},"Reisekjøring (ekstrakjøring)",{"$f":"IF(D34=\"\",\"\",IFERROR(VLOOKUP(D34,Helligdager_tabell,2,0),TEXT(D34,\"dddd\")))","v":"onsdag"},"2021-03-10",{"$f":"IF(F34=\"\",\"\",TEXT(F34,\"dddd\"))","v":"mandag"},"2021-03-15T20:00:00",{"$f":"TEXT(I34,\"dd.mm\")&\" kl 10:00 - 12:00\"","v":"16.03 kl 10:00 - 12:00"},{"$f":"IFERROR(VLOOKUP(I34,Helligdager_tabell,2,0),TEXT(I34,\"dddd\"))","v":"tirsdag"},"2021-03-16",{"$f":"IF(OR(LEFT($B34,5)=\"HOVED\",LEFT($B34,5)=\"13. k\"),WORKDAY(I34,3,Helligdager),IF(OR(LEFT($B34,5)=\"Reise\",LEFT($B34,5)=\"Bonus\",LEFT($B34,5)=\"2-mån\",LEFT($B34,5)=\"1-mån\"),WORKDAY(I34,2,Helligdager),\"\"))","v":"2021-03-18"}]
["Mar","1-månedsoppgjør (T1)","","","","","10.03*","torsdag","2021-03-18","2021-03-22"]
[{"$f":"IF(I36=\"\",\"\",PROPER(TEXT(I36,\"mmm\")))","v":"Mar"},"Bonuslønn",{"$f":"IF(D36=\"\",\"\",IFERROR(VLOOKUP(D36,Helligdager_tabell,2,0),TEXT(D36,\"dddd\")))","v":"mandag"},"2021-03-15",{"$f":"IF(F36=\"\",\"\",TEXT(F36,\"dddd\"))","v":"torsdag"},"2021-03-18T20:00:00",{"$f":"TEXT(I36,\"dd.mm\")&\" kl 10:00 - 12:00\"","v":"19.03 kl 10:00 - 12:00"},{"$f":"IFERROR(VLOOKUP(I36,Helligdager_tabell,2,0),TEXT(I36,\"dddd\"))","v":"fredag"},"2021-03-19",{"$f":"IF(OR(LEFT($B36,5)=\"HOVED\",LEFT($B36,5)=\"13. k\"),WORKDAY(I36,3,Helligdager),IF(OR(LEFT($B36,5)=\"Reise\",LEFT($B36,5)=\"Bonus\",LEFT($B36,5)=\"2-mån\",LEFT($B36,5)=\"1-mån\"),WORKDAY(I36,2,Helligdager),\"\"))","v":"2021-03-23"}]
["Mar","Reisekjøring (ekstrakjøring)","onsdag","2021-03-17","søndag","2021-03-21T20:00:00",{"$f":"TEXT(I37,\"dd.mm\")&\" kl 10:00 - 12:00\"","v":"22.03 kl 10:00 - 12:00"},"mandag","2021-03-22","2021-03-24"]
["Mar","Reisekjøring (alle kunder)","fredag","2021-03-19","onsdag","2021-03-24T20:00:00","25.03 kl 10:00 - 12:00","torsdag","2021-03-25","2021-03-29"]
["Mar","Innlesing tidfiler","fredag","2021-03-19","","",null,"torsdag","2021-03-25",""]
["Mar","SPK inneværende mnd","","","","","09.03*","onsdag","2021-03-31",""]
["Apr","A-meldingen","","","","",null,"tirsdag","2021-04-06",""]
["Apr","Innlesing av oppgjørsrapport fra NAV","","","","","01.04*","tirsdag","2021-04-06",""]
["Apr","HOVEDLØNN","fredag","2021-03-19","torsdag","2021-03-25T20:00:00","26.03 kl 12.00 - 06..04 kl 20.00                            For fullservice til :  06.04 kl 12.00","onsdag","2021-04-07","2021-04-12"]
[{"$f":"IF(I44=\"\",\"\",PROPER(TEXT(I44,\"mmm\")))","v":"Apr"},"Reisekjøring (alle kunder)",{"$f":"IF(D44=\"\",\"\",IFERROR(VLOOKUP(D44,Helligdager_tabell,2,0),TEXT(D44,\"dddd\")))","v":"onsdag"},"2021-03-31",{"$f":"IF(F44=\"\",\"\",TEXT(F44,\"dddd\"))","v":"torsdag"},"2021-04-08T20:00:00",{"$f":"TEXT(I44,\"dd.mm\")&\" kl 10:00 - 12:00\"","v":"09.04 kl 10:00 - 12:00"},{"$f":"IFERROR(VLOOKUP(I44,Helligdager_tabell,2,0),TEXT(I44,\"dddd\"))","v":"fredag"},"2021-04-09",{"$f":"IF(OR(LEFT($B44,5)=\"HOVED\",LEFT($B44,5)=\"13. k\"),WORKDAY(I44,3,Helligdager),IF(OR(LEFT($B44,5)=\"Reise\",LEFT($B44,5)=\"Bonus\",LEFT($B44,5)=\"2-mån\",LEFT($B44,5)=\"1-mån\"),WORKDAY(I44,2,Helligdager),\"\"))","v":"2021-04-13"}]
[{"$f":"IF(I45=\"\",\"\",PROPER(TEXT(I45,\"mmm\")))","v":"Apr"},"Bonuslønn",{"$f":"IF(D45=\"\",\"\",IFERROR(VLOOKUP(D45,Helligdager_tabell,2,0),TEXT(D45,\"dddd\")))","v":"tirsdag"},"2021-04-06",{"$f":"IF(F45=\"\",\"\",TEXT(F45,\"dddd\"))","v":"søndag"},"2021-04-11T20:00:00",{"$f":"TEXT(I45,\"dd.mm\")&\" kl 10:00 - 12:00\"","v":"12.04 kl 10:00 - 12:00"},{"$f":"IFERROR(VLOOKUP(I45,Helligdager_tabell,2,0),TEXT(I45,\"dddd\"))","v":"mandag"},"2021-04-12",{"$f":"IF(OR(LEFT($B45,5)=\"HOVED\",LEFT($B45,5)=\"13. k\"),WORKDAY(I45,3,Helligdager),IF(OR(LEFT($B45,5)=\"Reise\",LEFT($B45,5)=\"Bonus\",LEFT($B45,5)=\"2-mån\",LEFT($B45,5)=\"1-mån\"),WORKDAY(I45,2,Helligdager),\"\"))","v":"2021-04-14"}]
["Apr","Reisekjøring (ekstrakjøring)","onsdag","2021-04-07","mandag","2021-04-12T20:00:00",{"$f":"TEXT(I46,\"dd.mm\")&\" kl 10:00 - 12:00\"","v":"13.04 kl 10:00 - 12:00"},"tirsdag","2021-04-13","2021-04-15"]
[{"$f":"IF(I47=\"\",\"\",PROPER(TEXT(I47,\"mmm\")))","v":"Apr"},"1-månedsoppgjør (T1)",{"$f":"IF(D47=\"\",\"\",IFERROR(VLOOKUP(D47,Helligdager_tabell,2,0),TEXT(D47,\"dddd\")))","v":""},"",{"$f":"IF(F47=\"\",\"\",TEXT(F47,\"dddd\"))","v":""},"","09.04*",{"$f":"IFERROR(VLOOKUP(I47,Helligdager_tabell,2,0),TEXT(I47,\"dddd\"))","v":"fredag"},"2021-04-16",{"$f":"IF(OR(LEFT($B47,5)=\"HOVED\",LEFT($B47,5)=\"13. k\"),WORKDAY(I47,3,Helligdager),IF(OR(LEFT($B47,5)=\"Reise\",LEFT($B47,5)=\"Bonus\",LEFT($B47,5)=\"2-mån\",LEFT($B47,5)=\"1-mån\"),WORKDAY(I47,2,Helligdager),\"\"))","v":"2021-04-20"}]
["Apr","Reisekjøring (ekstrakjøring)","onsdag","2021-04-14","mandag","2021-04-19T20:00:00",{"$f":"TEXT(I48,\"dd.mm\")&\" kl 10:00 - 12:00\"","v":"20.04 kl 10:00 - 12:00"},"tirsdag","2021-04-20","2021-04-22"]
["Apr","Bonuslønn","fredag","2021-04-16","onsdag","2021-04-21T20:00:00","22.04 kl 10:00 - 12:00","torsdag","2021-04-22","2021-04-26"]
["Apr","Innlesing tidfiler","tirsdag","2021-04-20","","",null,"tirsdag","2021-04-27",""]
["Apr","Reisekjøring (alle kunder)","onsdag","2021-04-21","mandag","2021-04-26T20:00:00",{"$f":"TEXT(I51,\"dd.mm\")&\" kl 10:00 - 12:00\"","v":"27.04 kl 10:00 - 12:00"},"tirsdag","2021-04-27","2021-04-29"]
["Apr","SPK inneværende mnd","","","","","07.04*","fredag","2021-04-30",""]
["Mai","Reisekjøring (ekstrakjøring)","onsdag","2021-04-28","mandag","2021-05-03T20:00:00",{"$f":"TEXT(I53,\"dd.mm\")&\" kl 10:00 - 12:00\"","v":"04.05 kl 10:00 - 12:00"},"tirsdag","2021-05-04","2021-05-06"]
["Mai","A-meldingen","","","","",null,"onsdag","2021-05-05",""]
["Mai","Innlesing av oppgjørsrapport fra NAV","","","","","02.05*","torsdag","2021-05-06",""]
["Mai","HOVEDLØNN","tirsdag","2021-04-27","tirsdag","2021-05-04T20:00:00","05.05 kl 12.00 - 06.05 kl 20.00                            For fullservice til   06.05 kl 12.00","fredag","2021-05-07","2021-05-12"]
["Mai","Reisekjøring (alle kunder)","tirsdag","2021-05-04","søndag","2021-05-09T20:00:00",{"$f":"TEXT(I57,\"dd.mm\")&\" kl 10:00 - 12:00\"","v":"10.05 kl 10:00 - 12:00"},"mandag","2021-05-10","2021-05-14"]
[{"$f":"IF(I58=\"\",\"\",PROPER(TEXT(I58,\"mmm\")))","v":"Mai"},"Bonuslønn",{"$f":"IF(D58=\"\",\"\",IFERROR(VLOOKUP(D58,Helligdager_tabell,2,0),TEXT(D58,\"dddd\")))","v":"onsdag"},"2021-05-05",{"$f":"IF(F58=\"\",\"\",TEXT(F58,\"dddd\"))","v":"mandag"},"2021-05-10T20:00:00",{"$f":"TEXT(I58,\"dd.mm\")&\" kl 10:00 - 12:00\"","v":"11.05 kl 10:00 - 12:00"},{"$f":"IFERROR(VLOOKUP(I58,Helligdager_tabell,2,0),TEXT(I58,\"dddd\"))","v":"tirsdag"},"2021-05-11","2021-05-19"]
["Mai","2-månedsoppgjør (T2)","","","","","03.05*","onsdag","2021-05-12","2021-05-18"]
["Mai","1-månedsoppgjør (T1)","","","","","09.05*","tirsdag","2021-05-18","2021-05-20"]
["Mai","Reisekjøring (ekstrakjøring)","tirsdag","2021-05-11","tirsdag","2021-05-18T20:00:00",{"$f":"TEXT(I61,\"dd.mm\")&\" kl 10:00 - 12:00\"","v":"19.05 kl 10:00 - 12:00"},"onsdag","2021-05-19","2021-05-21"]
["Mai","Bonuslønn","onsdag","2021-05-19","mandag","2021-05-24T20:00:00","25.05 kl 10:00 - 12:00","tirsdag","2021-05-25","2021-05-27"]
["Mai","Innlesing tidfiler","torsdag","2021-05-20","","",null,"torsdag","2021-05-27",""]
["Mai","Reisekjøring (alle kunder)","onsdag","2021-05-19","onsdag","2021-05-26T20:00:00",{"$f":"TEXT(I64,\"dd.mm\")&\" kl 10:00 - 12:00\"","v":"27.05 kl 10:00 - 12:00"},"torsdag","2021-05-27","2021-05-31"]
["Mai","SPK inneværende mnd","","","","","07.05*","mandag","2021-05-31",""]
[{"$f":"IF(I66=\"\",\"\",PROPER(TEXT(I66,\"mmm\")))","v":"Jun"},"Reisekjøring (ekstrakjøring)",{"$f":"IF(D66=\"\",\"\",IFERROR(VLOOKUP(D66,Helligdager_tabell,2,0),TEXT(D66,\"dddd\")))","v":"torsdag"},"2021-05-27",{"$f":"IF(F66=\"\",\"\",TEXT(F66,\"dddd\"))","v":"tirsdag"},"2021-06-01T20:00:00",{"$f":"TEXT(I66,\"dd.mm\")&\" kl 10:00 - 12:00\"","v":"02.06 kl 10:00 - 12:00"},{"$f":"IFERROR(VLOOKUP(I66,Helligdager_tabell,2,0),TEXT(I66,\"dddd\"))","v":"onsdag"},"2021-06-02",{"$f":"IF(OR(LEFT($B66,5)=\"HOVED\",LEFT($B66,5)=\"13. k\"),WORKDAY(I66,3,Helligdager),IF(OR(LEFT($B66,5)=\"Reise\",LEFT($B66,5)=\"Bonus\",LEFT($B66,5)=\"2-mån\",LEFT($B66,5)=\"1-mån\"),WORKDAY(I66,2,Helligdager),\"\"))","v":"2021-06-04"}]
["Jun","A-meldingen","","","","",null,"mandag","2021-06-07",""]
["Jun","Innlesing av oppgjørsrapport fra NAV","","","","","01.06*","mandag","2021-06-07",""]
["Jun","HOVEDLØNN","onsdag","2021-05-26","onsdag","2021-06-02T20:00:00","03.06 kl 12.00 - 07.06 kl 20.00                            For fullservice til  07.06 kl 12.00","tirsdag","2021-06-08","2021-06-11"]
["Jun","Reisekjøring (alle kunder)","torsdag","2021-06-03","tirsdag","2021-06-08T20:00:00",{"$f":"TEXT(I70,\"dd.mm\")&\" kl 10:00 - 12:00\"","v":"09.06 kl 10:00 - 12:00"},"onsdag","2021-06-09","2021-06-11"]
["Jun","Bonuslønn","fredag","2021-06-04","onsdag","2021-06-09T20:00:00","10.06 kl 10:00 - 12:00","torsdag","2021-06-10","2021-06-14"]
["Jun","Reisekjøring (ekstrakjøring)","onsdag","2021-06-09","mandag","2021-06-14T20:00:00","15.06 kl 10:00 - 12:00","tirsdag","2021-06-15","2021-06-17"]
["Jun","1-månedsoppgjør (T1)","","","","","09.06*","torsdag","2021-06-17","2021-06-21"]
[{"$f":"IF(I74=\"\",\"\",PROPER(TEXT(I74,\"mmm\")))","v":"Jun"},"Reisekjøring (ekstrakjøring)",{"$f":"IF(D74=\"\",\"\",IFERROR(VLOOKUP(D74,Helligdager_tabell,2,0),TEXT(D74,\"dddd\")))","v":"onsdag"},"2021-06-16",{"$f":"IF(F74=\"\",\"\",TEXT(F74,\"dddd\"))","v":"mandag"},"2021-06-21T20:00:00",{"$f":"TEXT(I74,\"dd.mm\")&\" kl 10:00 - 12:00\"","v":"22.06 kl 10:00 - 12:00"},{"$f":"IFERROR(VLOOKUP(I74,Helligdager_tabell,2,0),TEXT(I74,\"dddd\"))","v":"tirsdag"},"2021-06-22",{"$f":"IF(OR(LEFT($B74,5)=\"HOVED\",LEFT($B74,5)=\"13. k\"),WORKDAY(I74,3,Helligdager),IF(OR(LEFT($B74,5)=\"Reise\",LEFT($B74,5)=\"Bonus\",LEFT($B74,5)=\"2-mån\",LEFT($B74,5)=\"1-mån\"),WORKDAY(I74,2,Helligdager),\"\"))","v":"2021-06-24"}]
["Jun","Bonuslønn","fredag","2021-06-18","onsdag","2021-06-23T20:00:00",{"$f":"TEXT(I75,\"dd.mm\")&\" kl 10:00 - 12:00\"","v":"24.06 kl 10:00 - 12:00"},"torsdag","2021-06-24","2021-06-28"]
["Jun","Innlesing tidfiler","mandag","2021-06-21","","",null,"fredag","2021-06-25",""]
["Jun","Reisekjøring (alle kunder)","tirsdag","2021-06-22","søndag","2021-06-27T20:00:00",{"$f":"TEXT(I77,\"dd.mm\")&\" kl 10:00 - 12:00\"","v":"28.06 kl 10:00 - 12:00"},"mandag","2021-06-28","2021-06-30"]
[{"$f":"IF(I78=\"\",\"\",PROPER(TEXT(I78,\"mmm\")))","v":"Jun"},"SPK inneværende mnd",{"$f":"IF(D78=\"\",\"\",IFERROR(VLOOKUP(D78,Helligdager_tabell,2,0),TEXT(D78,\"dddd\")))","v":""},"",{"$f":"IF(F78=\"\",\"\",TEXT(F78,\"dddd\"))","v":""},"","08.06*",{"$f":"IFERROR(VLOOKUP(I78,Helligdager_tabell,2,0),TEXT(I78,\"dddd\"))","v":"onsdag"},"2021-06-30",{"$f":"IF(OR(LEFT($B78,5)=\"HOVED\",LEFT($B78,5)=\"13. k\"),WORKDAY(I78,3,Helligdager),IF(OR(LEFT($B78,5)=\"Reise\",LEFT($B78,5)=\"Bonus\",LEFT($B78,5)=\"2-mån\",LEFT($B78,5)=\"1-mån\"),WORKDAY(I78,2,Helligdager),\"\"))","v":""}]
["Jul","A-meldingen","","","","",null,"mandag","2021-07-05",""]
["Jul","Innlesing av oppgjørsrapport fra NAV","","","","","01.07*","tirsdag","2021-07-06",""]
["Jul","HOVEDLØNN","fredag","2021-06-25","søndag","2021-07-04T20:00:00","05.07 kl 12.00 - 06.07 kl 20.00                            For fullservice til  06.07 kl 12.00","onsdag","2021-07-07","2021-07-12"]
["Jul","Reisekjøring (alle kunder)","fredag","2021-07-02","onsdag","2021-07-07T20:00:00",{"$f":"TEXT(I82,\"dd.mm\")&\" kl 10:00 - 12:00\"","v":"08.07 kl 10:00 - 12:00"},"torsdag","2021-07-08","2021-07-13"]
["Jul","2-månedsoppgjør (T2)","","","","","01.07*","tirsdag","2021-07-13","2021-07-15"]
["Jul","Reisekjøring (ekstrakjøring)","torsdag","2021-07-08","tirsdag","2021-07-13T20:00:00",{"$f":"TEXT(I84,\"dd.mm\")&\" kl 10:00 - 12:00\"","v":"14.07 kl 10:00 - 12:00"},"onsdag","2021-07-14","2021-07-16"]
[{"$f":"IF(I85=\"\",\"\",PROPER(TEXT(I85,\"mmm\")))","v":"Jul"},"Bonuslønn",{"$f":"IF(D85=\"\",\"\",IFERROR(VLOOKUP(D85,Helligdager_tabell,2,0),TEXT(D85,\"dddd\")))","v":"fredag"},"2021-07-09",{"$f":"IF(F85=\"\",\"\",TEXT(F85,\"dddd\"))","v":"onsdag"},"2021-07-14T20:00:00",{"$f":"TEXT(I85,\"dd.mm\")&\" kl 10:00 - 12:00\"","v":"15.07 kl 10:00 - 12:00"},{"$f":"IFERROR(VLOOKUP(I85,Helligdager_tabell,2,0),TEXT(I85,\"dddd\"))","v":"torsdag"},"2021-07-15",{"$f":"IF(OR(LEFT($B85,5)=\"HOVED\",LEFT($B85,5)=\"13. k\"),WORKDAY(I85,3,Helligdager),IF(OR(LEFT($B85,5)=\"Reise\",LEFT($B85,5)=\"Bonus\",LEFT($B85,5)=\"2-mån\",LEFT($B85,5)=\"1-mån\"),WORKDAY(I85,2,Helligdager),\"\"))","v":"2021-07-19"}]
["Jul","1-månedsoppgjør (T1)","","","","","09.07*","fredag","2021-07-16","2021-07-20"]
["Jul","Reisekjøring (ekstrakjøring)","tirsdag","2021-07-13","mandag","2021-07-19T20:00:00",{"$f":"TEXT(I87,\"dd.mm\")&\" kl 10:00 - 12:00\"","v":"20.07 kl 10:00 - 12:00"},"tirsdag","2021-07-20","2021-07-22"]
["Jul","Innlesing tidfiler","onsdag","2021-07-21","","",null,"tirsdag","2021-07-27",""]
["Jul","Reisekjøring (alle kunder)","tirsdag","2021-07-20","mandag","2021-07-26T20:00:00",{"$f":"TEXT(I89,\"dd.mm\")&\" kl 10:00 - 12:00\"","v":"27.07 kl 10:00 - 12:00"},"tirsdag","2021-07-27","2021-07-29"]
["Jul","SPK inneværende mnd","","","","","07.07*","fredag","2021-07-30",""]
["Aug","A-meldingen","","","","",null,"torsdag","2021-08-05",""]
["Aug","Innlesing av oppgjørsrapport fra NAV","","","","","01.08*","fredag","2021-08-06",""]
["Aug","HOVEDLØNN","onsdag","2021-07-28","onsdag","2021-08-04T20:00:00","05.08 kl 12.00 - 08.08 kl 20.00                                                       For fullservice til  06.08 kl 12.00","mandag","2021-08-09","2021-08-12"]
["Aug","Reisekjøring (alle kunder)","torsdag","2021-08-05","tirsdag","2021-08-10T20:00:00",{"$f":"TEXT(I94,\"dd.mm\")&\" kl 10:00 - 12:00\"","v":"11.08 kl 10:00 - 12:00"},"onsdag","2021-08-11","2021-08-13"]
["Aug","Bonuslønn","fredag","2021-08-06","onsdag","2021-08-11T20:00:00","12.08 kl 10:00 - 12:00","torsdag","2021-08-12","2021-08-16"]
["Aug","Reisekjøring (ekstrakjøring)","onsdag","2021-08-11","mandag","2021-08-16T20:00:00","17.08 kl 10:00 - 12:00","tirsdag","2021-08-17","2021-08-19"]
["Aug","1-månedsoppgjør (T1)","","","","","10.08*","onsdag","2021-08-18","2021-08-20"]
[{"$f":"IF(I98=\"\",\"\",PROPER(TEXT(I98,\"mmm\")))","v":"Aug"},"Reisekjøring (ekstrakjøring)",{"$f":"IF(D98=\"\",\"\",IFERROR(VLOOKUP(D98,Helligdager_tabell,2,0),TEXT(D98,\"dddd\")))","v":"onsdag"},"2021-08-18",{"$f":"IF(F98=\"\",\"\",TEXT(F98,\"dddd\"))","v":"mandag"},"2021-08-23T20:00:00",{"$f":"TEXT(I98,\"dd.mm\")&\" kl 10:00 - 12:00\"","v":"24.08 kl 10:00 - 12:00"},{"$f":"IFERROR(VLOOKUP(I98,Helligdager_tabell,2,0),TEXT(I98,\"dddd\"))","v":"tirsdag"},"2021-08-24",{"$f":"IF(OR(LEFT($B98,5)=\"HOVED\",LEFT($B98,5)=\"13. k\"),WORKDAY(I98,3,Helligdager),IF(OR(LEFT($B98,5)=\"Reise\",LEFT($B98,5)=\"Bonus\",LEFT($B98,5)=\"2-mån\",LEFT($B98,5)=\"1-mån\"),WORKDAY(I98,2,Helligdager),\"\"))","v":"2021-08-26"}]
["Aug","Bonuslønn","fredag","2021-08-20","onsdag","2021-08-25T20:00:00","26.08 kl 10:00 - 12:00","torsdag","2021-08-26","2021-08-30"]
["Aug","Reisekjøring (alle kunder)","mandag","2021-08-23","torsdag","2021-08-26T20:00:00","27.08 kl 10:00 - 12:00","fredag","2021-08-27","2021-08-31"]
["Aug","Innlesing tidfiler","fredag","2021-08-20","","",null,"fredag","2021-08-27",""]
["Aug","SPK inneværende mnd","","","","","09.08*","tirsdag","2021-08-31",""]
["Sep","Reisekjøring (ekstrakjøring)","fredag","2021-08-27","onsdag","2021-09-01T20:00:00",{"$f":"TEXT(I103,\"dd.mm\")&\" kl 10:00 - 12:00\"","v":"02.09 kl 10:00 - 12:00"},"torsdag","2021-09-02","2021-09-06"]
["Sep","A-meldingen","","","","",null,"mandag","2021-09-06",""]
["Sep","Innlesing av oppgjørsrapport fra NAV","","","","","01.09*","mandag","2021-09-06",""]
["Sep","HOVEDLØNN","torsdag","2021-08-26","torsdag","2021-09-02T20:00:00","3.09 kl 12.00 - 06.09 kl 20.00                            For fullservice til  06.09 kl 12.00","tirsdag","2021-09-07","2021-09-10"]
["Sep","Reisekjøring (alle kunder)","fredag","2021-09-03","onsdag","2021-09-08T20:00:00",{"$f":"TEXT(I107,\"dd.mm\")&\" kl 10:00 - 12:00\"","v":"09.09 kl 10:00 - 12:00"},"torsdag","2021-09-09","2021-09-13"]
["Sep","2-månedsoppgjør (T2)","","","","","01.09*","mandag","2021-09-13","2021-09-15"]
["Sep","Bonuslønn","onsdag","2021-09-08","mandag","2021-09-13T20:00:00",{"$f":"TEXT(I109,\"dd.mm\")&\" kl 10:00 - 12:00\"","v":"14.09 kl 10:00 - 12:00"},"tirsdag","2021-09-14","2021-09-16"]
["Sep","Reisekjøring (ekstrakjøring)","torsdag","2021-09-09","tirsdag","2021-09-14T20:00:00",{"$f":"TEXT(I110,\"dd.mm\")&\" kl 10:00 - 12:00\"","v":"15.09 kl 10:00 - 12:00"},"onsdag","2021-09-15","2021-09-17"]
[{"$f":"IF(I111=\"\",\"\",PROPER(TEXT(I111,\"mmm\")))","v":"Sep"},"1-månedsoppgjør (T1)",{"$f":"IF(D111=\"\",\"\",IFERROR(VLOOKUP(D111,Helligdager_tabell,2,0),TEXT(D111,\"dddd\")))","v":""},"",{"$f":"IF(F111=\"\",\"\",TEXT(F111,\"dddd\"))","v":""},"","09.09*",{"$f":"IFERROR(VLOOKUP(I111,Helligdager_tabell,2,0),TEXT(I111,\"dddd\"))","v":"torsdag"},"2021-09-16",{"$f":"IF(OR(LEFT($B111,5)=\"HOVED\",LEFT($B111,5)=\"13. k\"),WORKDAY(I111,3,Helligdager),IF(OR(LEFT($B111,5)=\"Reise\",LEFT($B111,5)=\"Bonus\",LEFT($B111,5)=\"2-mån\",LEFT($B111,5)=\"1-mån\"),WORKDAY(I111,2,Helligdager),\"\"))","v":"2021-09-20"}]
["Sep","Reisekjøring (ekstrakjøring)","onsdag","2021-09-15","mandag","2021-09-20T20:00:00","21.09 kl 10:00 - 12:00","tirsdag","2021-09-21","2021-09-23"]
["Sep","Bonuslønn","fredag","2021-09-17","onsdag","2021-09-22T20:00:00","23.09 kl 10:00 - 12:00","torsdag","2021-09-23","2021-09-27"]
["Sep","Innlesing tidfiler","mandag","2021-09-20","","",null,"mandag","2021-09-27",""]
["Sep","Reisekjøring (alle kunder)","onsdag","2021-09-22","mandag","2021-09-27T20:00:00",{"$f":"TEXT(I115,\"dd.mm\")&\" kl 10:00 - 12:00\"","v":"28.09 kl 10:00 - 12:00"},"tirsdag","2021-09-28","2021-09-30"]
[{"$f":"IF(I116=\"\",\"\",PROPER(TEXT(I116,\"mmm\")))","v":"Sep"},"SPK inneværende mnd",{"$f":"IF(D116=\"\",\"\",IFERROR(VLOOKUP(D116,Helligdager_tabell,2,0),TEXT(D116,\"dddd\")))","v":""},"",{"$f":"IF(F116=\"\",\"\",TEXT(F116,\"dddd\"))","v":""},"","07.09*",{"$f":"IFERROR(VLOOKUP(I116,Helligdager_tabell,2,0),TEXT(I116,\"dddd\"))","v":"torsdag"},"2021-09-30",{"$f":"IF(OR(LEFT($B116,5)=\"HOVED\",LEFT($B116,5)=\"13. k\"),WORKDAY(I116,3,Helligdager),IF(OR(LEFT($B116,5)=\"Reise\",LEFT($B116,5)=\"Bonus\",LEFT($B116,5)=\"2-mån\",LEFT($B116,5)=\"1-mån\"),WORKDAY(I116,2,Helligdager),\"\"))","v":""}]
["Okt","A-meldingen","","","","",null,"tirsdag","2021-10-05",""]
["Okt","Innlesing av oppgjørsrapport fra NAV","","","","","01.10*","onsdag","2021-10-06",""]
["Okt","HOVEDLØNN","mandag","2021-09-27","mandag","2021-10-04T20:00:00","05.10 kl 12.00 -06.10 kl 20.00                           For fullservice til   06.10 kl 12.00","torsdag","2021-10-07","2021-10-12"]
[{"$f":"IF(I120=\"\",\"\",PROPER(TEXT(I120,\"mmm\")))","v":"Okt"},"Reisekjøring (alle kunder)",{"$f":"IF(D120=\"\",\"\",IFERROR(VLOOKUP(D120,Helligdager_tabell,2,0),TEXT(D120,\"dddd\")))","v":"mandag"},"2021-10-04",{"$f":"IF(F120=\"\",\"\",TEXT(F120,\"dddd\"))","v":"torsdag"},"2021-10-07T20:00:00",{"$f":"TEXT(I120,\"dd.mm\")&\" kl 10:00 - 12:00\"","v":"08.10 kl 10:00 - 12:00"},{"$f":"IFERROR(VLOOKUP(I120,Helligdager_tabell,2,0),TEXT(I120,\"dddd\"))","v":"fredag"},"2021-10-08",{"$f":"IF(OR(LEFT($B120,5)=\"HOVED\",LEFT($B120,5)=\"13. k\"),WORKDAY(I120,3,Helligdager),IF(OR(LEFT($B120,5)=\"Reise\",LEFT($B120,5)=\"Bonus\",LEFT($B120,5)=\"2-mån\",LEFT($B120,5)=\"1-mån\"),WORKDAY(I120,2,Helligdager),\"\"))","v":"2021-10-12"}]
["Okt","Reisekjøring (ekstrakjøring)","torsdag","2021-10-07","tirsdag","2021-10-12T20:00:00",{"$f":"TEXT(I121,\"dd.mm\")&\" kl 10:00 - 12:00\"","v":"13.10 kl 10:00 - 12:00"},"onsdag","2021-10-13","2021-10-15"]
["Okt","Bonuslønn","fredag","2021-10-08","onsdag","2021-10-13T20:00:00","14.10 kl 10:00 - 12:00","torsdag","2021-10-14","2021-10-18"]
["Okt","1-månedsoppgjør (T1)","","","","","09.10*","mandag","2021-10-18","2021-10-20"]
["Okt","Reisekjøring (ekstrakjøring)","onsdag","2021-10-13","mandag","2021-10-18T20:00:00",{"$f":"TEXT(I124,\"dd.mm\")&\" kl 10:00 - 12:00\"","v":"19.10 kl 10:00 - 12:00"},"tirsdag","2021-10-19","2021-10-21"]
[{"$f":"IF(I125=\"\",\"\",PROPER(TEXT(I125,\"mmm\")))","v":"Okt"},"Reisekjøring (alle kunder)",{"$f":"IF(D125=\"\",\"\",IFERROR(VLOOKUP(D125,Helligdager_tabell,2,0),TEXT(D125,\"dddd\")))","v":"onsdag"},"2021-10-20",{"$f":"IF(F125=\"\",\"\",TEXT(F125,\"dddd\"))","v":"mandag"},"2021-10-25T20:00:00",{"$f":"TEXT(I125,\"dd.mm\")&\" kl 10:00 - 12:00\"","v":"26.10 kl 10:00 - 12:00"},{"$f":"IFERROR(VLOOKUP(I125,Helligdager_tabell,2,0),TEXT(I125,\"dddd\"))","v":"tirsdag"},"2021-10-26",{"$f":"IF(OR(LEFT($B125,5)=\"HOVED\",LEFT($B125,5)=\"13. k\"),WORKDAY(I125,3,Helligdager),IF(OR(LEFT($B125,5)=\"Reise\",LEFT($B125,5)=\"Bonus\",LEFT($B125,5)=\"2-mån\",LEFT($B125,5)=\"1-mån\"),WORKDAY(I125,2,Helligdager),\"\"))","v":"2021-10-28"}]
["Okt","Bonuslønn","torsdag","2021-10-21","tirsdag","2021-10-26T20:00:00","27.10 kl 10:00 - 12:00","onsdag","2021-10-27","2021-10-29"]
["Okt","Innlesing tidfiler","torsdag","2021-10-21","","",null,"onsdag","2021-10-27",""]
["Okt","SPK inneværende mnd","","","","","07.10*","fredag","2021-10-29",""]
[{"$f":"IF(I129=\"\",\"\",PROPER(TEXT(I129,\"mmm\")))","v":"Nov"},"Reisekjøring (ekstrakjøring)",{"$f":"IF(D129=\"\",\"\",IFERROR(VLOOKUP(D129,Helligdager_tabell,2,0),TEXT(D129,\"dddd\")))","v":"torsdag"},"2021-10-28",{"$f":"IF(F129=\"\",\"\",TEXT(F129,\"dddd\"))","v":"tirsdag"},"2021-11-02T20:00:00",{"$f":"TEXT(I129,\"dd.mm\")&\" kl 10:00 - 12:00\"","v":"03.11 kl 10:00 - 12:00"},{"$f":"IFERROR(VLOOKUP(I129,Helligdager_tabell,2,0),TEXT(I129,\"dddd\"))","v":"onsdag"},"2021-11-03",{"$f":"IF(OR(LEFT($B129,5)=\"HOVED\",LEFT($B129,5)=\"13. k\"),WORKDAY(I129,3,Helligdager),IF(OR(LEFT($B129,5)=\"Reise\",LEFT($B129,5)=\"Bonus\",LEFT($B129,5)=\"2-mån\",LEFT($B129,5)=\"1-mån\"),WORKDAY(I129,2,Helligdager),\"\"))","v":"2021-11-05"}]
[{"$f":"IF(I130=\"\",\"\",PROPER(TEXT(I130,\"mmm\")))","v":"Nov"},"A-meldingen",{"$f":"IF(D130=\"\",\"\",IFERROR(VLOOKUP(D130,Helligdager_tabell,2,0),TEXT(D130,\"dddd\")))","v":""},"",{"$f":"IF(F130=\"\",\"\",TEXT(F130,\"dddd\"))","v":""},"",null,{"$f":"IFERROR(VLOOKUP(I130,Helligdager_tabell,2,0),TEXT(I130,\"dddd\"))","v":"fredag"},"2021-11-05",{"$f":"IF(OR(LEFT($B130,5)=\"HOVED\",LEFT($B130,5)=\"13. k\"),WORKDAY(I130,3,Helligdager),IF(OR(LEFT($B130,5)=\"Reise\",LEFT($B130,5)=\"Bonus\",LEFT($B130,5)=\"2-mån\",LEFT($B130,5)=\"1-mån\"),WORKDAY(I130,2,Helligdager),\"\"))","v":""}]
[{"$f":"IF(I131=\"\",\"\",PROPER(TEXT(I131,\"mmm\")))","v":"Nov"},"Innlesing av oppgjørsrapport fra NAV",{"$f":"IF(D131=\"\",\"\",IFERROR(VLOOKUP(D131,Helligdager_tabell,2,0),TEXT(D131,\"dddd\")))","v":""},"",{"$f":"IF(F131=\"\",\"\",TEXT(F131,\"dddd\"))","v":""},"","01.11*",{"$f":"IFERROR(VLOOKUP(I131,Helligdager_tabell,2,0),TEXT(I131,\"dddd\"))","v":"mandag"},"2021-11-08",{"$f":"IF(OR(LEFT($B131,5)=\"HOVED\",LEFT($B131,5)=\"13. k\"),WORKDAY(I131,3,Helligdager),IF(OR(LEFT($B131,5)=\"Reise\",LEFT($B131,5)=\"Bonus\",LEFT($B131,5)=\"2-mån\",LEFT($B131,5)=\"1-mån\"),WORKDAY(I131,2,Helligdager),\"\"))","v":""}]
["Nov","HOVEDLØNN","torsdag","2021-10-28","torsdag","2021-11-04T20:00:00","05.11 kl 12.00 - 08.11 kl 20.00                           For fullservice til  8.11 kl 12.00","tirsdag","2021-11-09","2021-11-12"]
["Nov","Reisekjøring (alle kunder)","fredag","2021-11-05","tirsdag","2021-11-09T20:00:00",{"$f":"TEXT(I133,\"dd.mm\")&\" kl 10:00 - 12:00\"","v":"10.11 kl 10:00 - 12:00"},"onsdag","2021-11-10","2021-11-16"]
["Nov","2-månedsoppgjør (T2)","","","","","01.11*","torsdag","2021-11-11","2021-11-15"]
["Nov","Bonuslønn","mandag","2021-11-08","torsdag","2021-11-11T20:00:00",{"$f":"TEXT(I135,\"dd.mm\")&\" kl 10:00 - 12:00\"","v":"12.11 kl 10:00 - 12:00"},"fredag","2021-11-12","2021-11-17"]
[{"$f":"IF(I136=\"\",\"\",PROPER(TEXT(I136,\"mmm\")))","v":"Nov"},"Reisekjøring (ekstrakjøring)",{"$f":"IF(D136=\"\",\"\",IFERROR(VLOOKUP(D136,Helligdager_tabell,2,0),TEXT(D136,\"dddd\")))","v":"onsdag"},"2021-11-10",{"$f":"IF(F136=\"\",\"\",TEXT(F136,\"dddd\"))","v":"mandag"},"2021-11-15T20:00:00",{"$f":"TEXT(I136,\"dd.mm\")&\" kl 10:00 - 12:00\"","v":"16.11 kl 10:00 - 12:00"},{"$f":"IFERROR(VLOOKUP(I136,Helligdager_tabell,2,0),TEXT(I136,\"dddd\"))","v":"tirsdag"},"2021-11-16",{"$f":"IF(OR(LEFT($B136,5)=\"HOVED\",LEFT($B136,5)=\"13. k\"),WORKDAY(I136,3,Helligdager),IF(OR(LEFT($B136,5)=\"Reise\",LEFT($B136,5)=\"Bonus\",LEFT($B136,5)=\"2-mån\",LEFT($B136,5)=\"1-mån\"),WORKDAY(I136,2,Helligdager),\"\"))","v":"2021-11-18"}]
["Nov","1-månedsoppgjør (T1)","","","","","10.11*","torsdag","2021-11-18","2021-11-22"]
["Nov","Reisekjøring (alle kunder)","onsdag","2021-11-17","mandag","2021-11-22T20:00:00",{"$f":"TEXT(I138,\"dd.mm\")&\" kl 10:00 - 12:00\"","v":"23.11 kl 10:00 - 12:00"},"tirsdag","2021-11-23","2021-11-25"]
["Nov","Bonuslønn","fredag","2021-11-19","onsdag","2021-11-24T20:00:00","25.11 kl 10:00 - 12:00","torsdag","2021-11-25","2021-11-29"]
["Nov","Fraværskvoter neste år (unntatt ferie)","","","","",null,"fredag","2021-11-26",""]
["Nov","Innlesing tidfiler","fredag","2021-11-19","","",null,"fredag","2021-11-26",""]
["Nov","SPK inneværende mnd","","","","","09.11*","tirsdag","2021-11-30",""]
[{"$f":"IF(I143=\"\",\"\",PROPER(TEXT(I143,\"mmm\")))","v":"Des"},"Reisekjøring (ekstrakjøring)",{"$f":"IF(D143=\"\",\"\",IFERROR(VLOOKUP(D143,Helligdager_tabell,2,0),TEXT(D143,\"dddd\")))","v":"torsdag"},"2021-11-25",{"$f":"IF(F143=\"\",\"\",TEXT(F143,\"dddd\"))","v":"tirsdag"},"2021-11-30T20:00:00",{"$f":"TEXT(I143,\"dd.mm\")&\" kl 10:00 - 12:00\"","v":"01.12 kl 10:00 - 12:00"},{"$f":"IFERROR(VLOOKUP(I143,Helligdager_tabell,2,0),TEXT(I143,\"dddd\"))","v":"onsdag"},"2021-12-01",{"$f":"IF(OR(LEFT($B143,5)=\"HOVED\",LEFT($B143,5)=\"13. k\"),WORKDAY(I143,3,Helligdager),IF(OR(LEFT($B143,5)=\"Reise\",LEFT($B143,5)=\"Bonus\",LEFT($B143,5)=\"2-mån\",LEFT($B143,5)=\"1-mån\"),WORKDAY(I143,2,Helligdager),\"\"))","v":"2021-12-03"}]
["Des","A-meldingen","","","","",null,"mandag","2021-12-06",""]
["Des","Innlesing av oppgjørsrapport fra NAV","","","","","01.12*","mandag","2021-12-06",""]
["Des","HOVEDLØNN","torsdag","2021-11-25","torsdag","2021-12-02T20:00:00","03.12 kl 12.00 - 06.12 kl 20.00                            For fullservice til  06.12 kl 12.00 ","tirsdag","2021-12-07","2021-12-10"]
["Des","Feriekvoter neste år","","","","","08.12 *","fredag","2021-12-31",""]
["Des","Reisekjøring (alle kunder)","fredag","2021-12-03","onsdag","2021-12-08T20:00:00",{"$f":"TEXT(I148,\"dd.mm\")&\" kl 10:00 - 12:00\"","v":"09.12 kl 10:00 - 12:00"},"torsdag","2021-12-09","2021-12-13"]
["Des","Bonuslønn","onsdag","2021-12-08","mandag","2021-12-13T20:00:00","14.12 kl 10:00 - 12:00","tirsdag","2021-12-14","2021-12-16"]
["Des","1-månedsoppgjør (T1)","","","","","09.12*","torsdag","2021-12-16","2021-12-20"]
["Des","Reisekjøring (alle kunder)","fredag","2021-12-10","onsdag","2021-12-15T20:00:00",{"$f":"TEXT(I151,\"dd.mm\")&\" kl 10:00 - 12:00\"","v":"16.12 kl 10:00 - 12:00"},"torsdag","2021-12-16","2021-12-21"]
["Des","13. KJØRING","fredag","2021-12-10","søndag","2021-12-19T20:00:00","20.12 kl 11.00 - 21.12 kl 16.00 (21.12.kl 12.00 for fullservicekunder)","onsdag","2021-12-22","2021-12-28"]
["Des","Innlesing tidfiler","fredag","2021-12-17","","",null,"torsdag","2021-12-23",""]
["Des","SPK inneværende mnd","","","","","22.12*","fredag","2021-12-31",""]
["Jan","Henting av E-skattekort for neste år","","","","","22.12*","mandag","2021-01-04",""]
["Jan","A-meldingen","","","","",null,"onsdag","2022-01-05",""]
["Jan","Innlesing av oppgjørsrapport fra NAV","","","","","02.01*","torsdag","2022-01-06",""]
["Jan","HOVEDLØNN jan 2022","mandag","2021-12-20","tirsdag","2022-01-04T20:00:00","05.01 kl 12.00 - 06.01 kl 20.00                            For fullservice til  06.01.kl 12.00","fredag","2022-01-07","2022-01-12"]
["","2-månedsoppgjør (T2)","","","",null,"Kommer på kjøreplanen for 2022",null,null,"2022-01-15"]
[null,null,null,null,null,null,"* For innlesing av tidfiler og oppgjørsrapport fra NAV og årlig skattekortinnhenting, samt kjøring i T1,T2 og SPK angir dato i denne kolonnen tidligste dato kjøringen kan foretas. Lønnskjøringen må være avsluttet."]

{"sheet":"Input","index":1,"n_rows":27,"n_cols":2,"rows_kept":27,"cut":false,"hidden":false,"merged":[]}
["Helligdager","Hellidag Navn"]
["2021-01-01","1. nyttårsdag"]
["2021-03-28","Palmesøndag"]
["2021-04-01","Skjærtorsdag"]
["2021-04-02","Langfredag"]
["2021-04-04","1. påskedag"]
["2021-04-05","2. påskedag"]
["2021-05-01","Offentlig høytidsdag"]
["2021-05-13","Kristi Himmelfartsdag"]
["2021-05-17","Grunnlovsdag"]
["2021-05-23","1. pinsedag"]
["2021-05-24","2. pinsedag"]
["2021-12-25","1. juledag"]
["2021-12-26","2. juledag"]
["2022-01-01","1. nyttårsdag"]
["2022-04-10","Palmesøndag"]
["2022-04-14","Skjærtorsdag"]
["2022-04-15","Langfredag"]
["2022-04-17","1. påskedag"]
["2022-04-18","2. påskedag"]
["2022-05-01","Offentlig høytidsdag"]
["2022-05-17","Grunnlovsdag"]
["2022-05-26","Kristi Himmelfartsdag"]
["2022-06-05","1. pinsedag"]
["2022-06-06","2. pinsedag"]
["2022-12-25","1. juledag"]
["2022-12-26","2. juledag"]

{"sheet":"Erik Arbeidsark","index":2,"n_rows":98,"n_cols":20,"rows_kept":98,"cut":false,"hidden":true,"merged":[[0,2,0,3],[0,4,0,5],[0,6,0,7],[0,0,0,1],[0,8,0,9]]}
["Når DFØ registrerer manuelle bilag eller skal lese inn transaksjoner fra fil, må bilaget/fila  være mottatt av DFØ senest  dato i denne kolonnen.",null,"Registrering - og godkjenningsfrist for godkjenner2 ",null,"Kontrollperiode lønn og reise/ Tidligste kjøredato andre kjøringer",null,"Siste frist for å ha avsluttet  kjøringen",null,"Utbetalings-dato"]
["Uten","Med","Uten","Med","Uten","Med","Uten","Med","Uten","Med",null,null,"test","test","test","test","Dato","test","test","test"]
["A-meldingen","HOVEDLØNN","A-meldingen","HOVEDLØNN","A-meldingen","Innlesing av oppgjørsrapport fra NAV","2-månedsoppgjør (T2)","A-meldingen","A-meldingen","HOVEDLØNN",{"$f":"IF(OR(LEFT(J3,5)=\"HOVED\",LEFT(J3,5)=\"13. k\"),3,IF(OR(LEFT(J3,5)=\"Reise\",LEFT(J3,5)=\"Bonus\",LEFT(J3,5)=\"2-mån\",LEFT(J3,5)=\"1-mån\"),2,\"\"))","v":3},null,"Torsdag 19. des",{"$f":"SUBSTITUTE(M3,\"  \",\" \")","v":"Torsdag 19. des"},{"$f":"LEFT(M3,SEARCH(\" \",M3)-1)","v":"Torsdag"},{"$f":"RIGHT(N3,LEN(N3)-SEARCH(\" \",N3))","v":"19. des"},"2020-12-19","2020-12-19"]
["Innlesing av oppgjørsrapport fra NAV","Reisekjøring (alle kunder)","Innlesing av oppgjørsrapport fra NAV","Reisekjøring (alle kunder)","Innlesing tidfiler","HOVEDLØNN",null,"Innlesing av oppgjørsrapport fra NAV","Innlesing av oppgjørsrapport fra NAV","Reisekjøring (alle kunder)",null,null,"Mandag 6. jan",{"$f":"SUBSTITUTE(M4,\"  \",\" \")","v":"Mandag 6. jan"},{"$f":"LEFT(M4,SEARCH(\" \",M4)-1)","v":"Mandag"},{"$f":"RIGHT(N4,LEN(N4)-SEARCH(\" \",N4))","v":"6. jan"},"2020-01-06",{"$f":"DATE(2021,MONTH(Q4),DAY(Q4))","v":"2021-01-06"}]
["2-månedsoppgjør (T2)","Bonuslønn","2-månedsoppgjør (T2)","Bonuslønn","Fraværskvoter neste år (unntatt ferie)","Reisekjøring (alle kunder)",null,"HOVEDLØNN","Innlesing tidfiler","2-månedsoppgjør (T2)",null,null,"Onsdag 8. jan","Onsdag 8. jan","Onsdag","8. jan","2020-01-08",{"$f":"DATE(2021,MONTH(Q5),DAY(Q5))","v":"2021-01-08"}]
["1-månedsoppgjør (T1)","Reisekjøring (ekstrakjøring)","1-månedsoppgjør (T1)","Reisekjøring (ekstrakjøring)",null,"2-månedsoppgjør (T2)",null,"Reisekjøring (alle kunder)","SPK inneværende mnd","Bonuslønn",null,null,"Torsdag 9. jan","Torsdag 9. jan","Torsdag","9. jan","2020-01-09","2021-01-09"]
["SPK inneværende mnd","Innlesing tidfiler","Innlesing tidfiler","13. KJØRING",null,"Bonuslønn",null,"2-månedsoppgjør (T2)","Kontrolliste for pensjonsgivende tillegg","Reisekjøring (ekstrakjøring)",null,null,"Onsdag 15. jan","Onsdag 15. jan","Onsdag","15. jan","2020-01-15","2021-01-15"]
["Kontrolliste for pensjonsgivende tillegg","13. KJØRING","SPK inneværende mnd","HOVEDLØNN jan 2021",null,"Reisekjøring (ekstrakjøring)",null,"Bonuslønn","Fraværskvoter neste år (unntatt ferie)","1-månedsoppgjør (T1)",null,null,"Tirsdag 21.jan","Tirsdag 21.jan","Tirsdag","21.jan","2020-01-21","2021-01-21"]
["Fraværskvoter neste år (unntatt ferie)","HOVEDLØNN jan 2021","Kontrolliste for pensjonsgivende tillegg",null,null,"1-månedsoppgjør (T1)",null,"Reisekjøring (ekstrakjøring)","Feriekvoter neste år","13. KJØRING",null,null,"Tirsdag 21. jan","Tirsdag 21. jan","Tirsdag","21. jan","2020-01-21","2021-01-21"]
["Feriekvoter neste år",null,"Fraværskvoter neste år (unntatt ferie)",null,null,"SPK inneværende mnd",null,"1-månedsoppgjør (T1)","Henting av E-skattekort for neste år","HOVEDLØNN jan 2021",null,null,"Onsdag 22. jan","Onsdag 22. jan","Onsdag","22. jan","2020-01-22","2021-01-22"]
["Henting av E-skattekort for neste år",null,"Feriekvoter neste år",null,null,"Kontrolliste for pensjonsgivende tillegg",null,"Innlesing tidfiler",null,null,null,null,"Mandag 27. jan","Mandag 27. jan","Mandag","27. jan","2020-01-27","2021-01-27"]
[null,null,"Henting av E-skattekort for neste år",null,null,"Feriekvoter neste år",null,"SPK inneværende mnd",null,null,null,null,"Onsdag 5. feb","Onsdag 5. feb","Onsdag","5. feb","2020-02-05","2021-02-05"]
[null,null,null,null,null,"13. KJØRING",null,"Kontrolliste for pensjonsgivende tillegg",null,null,null,null,"Fredag 7. feb","Fredag 7. feb","Fredag","7. feb","2020-02-07","2021-02-07"]
[null,null,null,null,null,"Henting av E-skattekort for neste år",null,"Fraværskvoter neste år (unntatt ferie)",null,null,null,null,"Mandag 10. feb","Mandag 10. feb","Mandag","10. feb","2020-02-10","2021-02-10"]
[null,null,null,null,null,"HOVEDLØNN jan 2021",null,"Feriekvoter neste år",null,null,null,null,"Torsdag 13. feb","Torsdag 13. feb","Torsdag","13. feb","2020-02-13","2021-02-13"]
[null,null,null,null,null,null,null,"13. KJØRING",null,null,null,null,"Onsdag 19. feb","Onsdag 19. feb","Onsdag","19. feb","2020-02-19","2021-02-19"]
[null,null,null,null,null,null,null,"Henting av E-skattekort for neste år",null,null,null,null,"Torsdag 20. feb","Torsdag 20. feb","Torsdag","20. feb","2020-02-20","2021-02-20"]
[null,null,null,null,null,null,null,"HOVEDLØNN jan 2021",null,null,null,null,"Torsdag 20. feb","Torsdag 20. feb","Torsdag","20. feb","2020-02-20","2021-02-20"]
[null,null,null,null,null,null,null,null,null,null,null,null,"Onsdag 26. feb","Onsdag 26. feb","Onsdag","26. feb","2020-02-26","2021-02-26"]
[null,null,null,null,null,null,null,null,null,null,null,null,"Onsdag 4. mar","Onsdag 4. mar","Onsdag","4. mar","2020-03-04","2021-03-04"]
[null,null,null,null,null,null,null,null,null,null,null,null,"Torsdag 5. mar","Torsdag 5. mar","Torsdag","5. mar","2020-03-05","2021-03-05"]
[null,null,null,null,null,null,null,null,null,null,null,null,"Mandag 9. mar","Mandag 9. mar","Mandag","9. mar","2020-03-09","2021-03-09"]
[null,null,null,null,null,null,null,null,null,null,null,null,"Onsdag 11. mar","Onsdag 11. mar","Onsdag","11. mar","2020-03-11","2021-03-11"]
[null,null,null,null,null,null,null,null,null,null,null,null,"Tirsdag 17. mar","Tirsdag 17. mar","Tirsdag","17. mar","2020-03-17","2021-03-17"]
[null,null,null,null,null,null,null,null,null,null,null,null,"Torsdag 19. mar ","Torsdag 19. mar ","Torsdag","19. mar ","2020-03-19","2021-03-19"]
[null,null,null,null,null,null,null,null,null,null,null,null,"Fredag 20. mar","Fredag 20. mar","Fredag","20. mar","2020-03-20","2021-03-20"]
[null,null,null,null,null,null,null,null,null,null,null,null,"Fredag 20.mar","Fredag 20.mar","Fredag","20.mar","2020-03-20","2021-03-20"]
[null,null,null,null,null,null,null,null,null,null,null,null,"Tirsdag 24. mar","Tirsdag 24. mar","Tirsdag","24. mar","2020-03-24","2021-03-24"]
[null,null,null,null,null,null,null,null,null,null,null,null,"Torsdag 2. apr","Torsdag 2. apr","Torsdag","2. apr","2020-04-02","2021-04-02"]
[null,null,null,null,null,null,null,null,null,null,null,null,"Torsdag 2. apr","Torsdag 2. apr","Torsdag","2. apr","2020-04-02","2021-04-02"]
[null,null,null,null,null,null,null,null,null,null,null,null,"Onsdag 15. apr","Onsdag 15. apr","Onsdag","15. apr","2020-04-15","2021-04-15"]
[null,null,null,null,null,null,null,null,null,null,null,null,"Tirsdag 21. apr","Tirsdag 21. apr","Tirsdag","21. apr","2020-04-21","2021-04-21"]
[null,null,null,null,null,null,null,null,null,null,null,null,"Mandag 20. apr","Mandag 20. apr","Mandag","20. apr","2020-04-20","2021-04-20"]
[null,null,null,null,null,null,null,null,null,null,null,null,"Onsdag 22. apr","Onsdag 22. apr","Onsdag","22. apr","2020-04-22","2021-04-22"]
[null,null,null,null,null,null,null,null,null,null,null,null,"Tirsdag 25. apr","Tirsdag 25. apr","Tirsdag","25. apr","2020-04-25","2021-04-25"]
[null,null,null,null,null,null,null,null,null,null,null,null,"Fredag 24.apr","Fredag 24.apr","Fredag","24.apr","2020-04-24","2021-04-24"]
[null,null,null,null,null,null,null,null,null,null,null,null,"Onsdag 6. mai","Onsdag 6. mai","Onsdag","6. mai","2020-05-06","2021-05-06"]
[null,null,null,null,null,null,null,null,null,null,null,null,"Fredag 8. mai","Fredag 8. mai","Fredag","8. mai","2020-05-08","2021-05-08"]
[null,null,null,null,null,null,null,null,null,null,null,null,"Onsdag 13. mai","Onsdag 13. mai","Onsdag","13. mai","2020-05-13","2021-05-13"]
[null,null,null,null,null,null,null,null,null,null,null,null,"Tirsdag 19. mai","Tirsdag 19. mai","Tirsdag","19. mai","2020-05-19","2021-05-19"]
[null,null,null,null,null,null,null,null,null,null,null,null,"Onsdag 20. mai","Onsdag 20. mai","Onsdag","20. mai","2020-05-20","2021-05-20"]
[null,null,null,null,null,null,null,null,null,null,null,null,"Onsdag 20. mai","Onsdag 20. mai","Onsdag","20. mai","2020-05-20","2021-05-20"]
[null,null,null,null,null,null,null,null,null,null,null,null,"Tirsdag 26. mai","Tirsdag 26. mai","Tirsdag","26. mai","2020-05-26","2021-05-26"]
[null,null,null,null,null,null,null,null,null,null,null,null,"Onsdag 27. mai","Onsdag 27. mai","Onsdag","27. mai","2020-05-27","2021-05-27"]
[null,null,null,null,null,null,null,null,null,null,null,null,"Torsdag 4. juni","Torsdag 4. juni","Torsdag","4. juni","2020-06-04","2021-06-04"]
[null,null,null,null,null,null,null,null,null,null,null,null,"Fredag 5. jun","Fredag 5. jun","Fredag","5. jun","2020-06-05","2021-06-05"]
[null,null,null,null,null,null,null,null,null,null,null,null,"Onsdag 10. jun","Onsdag 10. jun","Onsdag","10. jun","2020-06-10","2021-06-10"]
[null,null,null,null,null,null,null,null,null,null,null,null,"Fredag 19. jun ","Fredag 19. jun ","Fredag","19. jun ","2020-06-19","2021-06-19"]
[null,null,null,null,null,null,null,null,null,null,null,null,"Mandag 22. jun","Mandag 22. jun","Mandag","22. jun","2020-06-22","2021-06-22"]
[null,null,null,null,null,null,null,null,null,null,null,null,"Mandag 21. jun","Mandag 21. jun","Mandag","21. jun","2020-06-21","2021-06-21"]
[null,null,null,null,null,null,null,null,null,null,null,null,"Fredag 26. jun","Fredag 26. jun","Fredag","26. jun","2020-06-26","2021-06-26"]
[null,null,null,null,null,null,null,null,null,null,null,null,"Torsdag 25. jun","Torsdag 25. jun","Torsdag","25. jun","2020-06-25","2021-06-25"]
[null,null,null,null,null,null,null,null,null,null,null,null,"Mandag 6. jul","Mandag 6. jul","Mandag","6. jul","2020-07-06","2021-07-06"]
[null,null,null,null,null,null,null,null,null,null,null,null,"Onsdag 8. jul","Onsdag 8. jul","Onsdag","8. jul","2020-07-08","2021-07-08"]
[null,null,null,null,null,null,null,null,null,null,null,null,"Fredag 10. jul","Fredag 10. jul","Fredag","10. jul","2020-07-10","2021-07-10"]
[null,null,null,null,null,null,null,null,null,null,null,null,"Onsdag 15. jul","Onsdag 15. jul","Onsdag","15. jul","2020-07-15","2021-07-15"]
[null,null,null,null,null,null,null,null,null,null,null,null,"Tiirsdag 21. jul","Tiirsdag 21. jul","Tiirsdag","21. jul","2020-07-21","2021-07-21"]
[null,null,null,null,null,null,null,null,null,null,null,null,"Torsdag 23. jul","Torsdag 23. jul","Torsdag","23. jul","2020-07-23","2021-07-23"]
[null,null,null,null,null,null,null,null,null,null,null,null,"Tirsdag 28. jul","Tirsdag 28. jul","Tirsdag","28. jul","2020-07-28","2021-07-28"]
[null,null,null,null,null,null,null,null,null,null,null,null,"Onsdag 5. aug","Onsdag 5. aug","Onsdag","5. aug","2020-08-05","2021-08-05"]
[null,null,null,null,null,null,null,null,null,null,null,null,"Fredag 7. aug","Fredag 7. aug","Fredag","7. aug","2020-08-07","2021-08-07"]
[null,null,null,null,null,null,null,null,null,null,null,null,"Tirsdag 11. aug","Tirsdag 11. aug","Tirsdag","11. aug","2020-08-11","2021-08-11"]
[null,null,null,null,null,null,null,null,null,null,null,null,"Tirsdag 18. aug","Tirsdag 18. aug","Tirsdag","18. aug","2020-08-18","2021-08-18"]
[null,null,null,null,null,null,null,null,null,null,null,null,"Torsdag 20. aug","Torsdag 20. aug","Torsdag","20. aug","2020-08-20","2021-08-20"]
[null,null,null,null,null,null,null,null,null,null,null,null,"Fredag 21. aug","Fredag 21. aug","Fredag","21. aug","2020-08-21","2021-08-21"]
[null,null,null,null,null,null,null,null,null,null,null,null,"Fredag 21. aug","Fredag 21. aug","Fredag","21. aug","2020-08-21","2021-08-21"]
[null,null,null,null,null,null,null,null,null,null,null,null,"Fredag 29. aug","Fredag 29. aug","Fredag","29. aug","2020-08-29","2021-08-29"]
[null,null,null,null,null,null,null,null,null,null,null,null,"Torsdag 27. aug",{"$f":"SUBSTITUTE(M68,\"  \",\" \")","v":"Torsdag 27. aug"},{"$f":"LEFT(M68,SEARCH(\" \",M68)-1)","v":"Torsdag"},{"$f":"RIGHT(N68,LEN(N68)-SEARCH(\" \",N68))","v":"27. aug"},"2020-08-27","2021-08-27"]
[null,null,null,null,null,null,null,null,null,null,null,null,"Fredag 4. sep","Fredag 4. sep","Fredag","4. sep","2020-09-04",{"$f":"DATE(2021,MONTH(Q69),DAY(Q69))","v":"2021-09-04"}]
[null,null,null,null,null,null,null,null,null,null,null,null,"Onsdag 9. sep","Onsdag 9. sep","Onsdag","9. sep","2020-09-09","2021-09-09"]
[null,null,null,null,null,null,null,null,null,null,null,null,"Fredag 11. sep","Fredag 11. sep","Fredag","11. sep","2020-09-11","2021-09-11"]
[null,null,null,null,null,null,null,null,null,null,null,null,"Onsdag 16. sep","Onsdag 16. sep","Onsdag","16. sep","2020-09-16","2021-09-16"]
[null,null,null,null,null,null,null,null,null,null,null,null,"Mandag 21. sept","Mandag 21. sept","Mandag","21. sept","2020-09-21","2021-09-21"]
[null,null,null,null,null,null,null,null,null,null,null,null,"Mandag 21.sep","Mandag 21.sep","Mandag","21.sep","2020-09-21","2021-09-21"]
[null,null,null,null,null,null,null,null,null,null,null,null,"Tirsdag 22. sep","Tirsdag 22. sep","Tirsdag","22. sep","2020-09-22","2021-09-22"]
[null,null,null,null,null,null,null,null,null,null,null,null,"Fredag 25. sep","Fredag 25. sep","Fredag","25. sep","2020-09-25","2021-09-25"]
[null,null,null,null,null,null,null,null,null,null,null,null,"Tirsdag 6. okt","Tirsdag 6. okt","Tirsdag","6. okt","2020-10-06","2021-10-06"]
[null,null,null,null,null,null,null,null,null,null,null,null,"Fredag 9. okt","Fredag 9. okt","Fredag","9. okt","2020-10-09","2021-10-09"]
[null,null,null,null,null,null,null,null,null,null,null,null,"Onsdag 14. okt","Onsdag 14. okt","Onsdag","14. okt","2020-10-14","2021-10-14"]
[null,null,null,null,null,null,null,null,null,null,null,null,"Mandag 19. okt","Mandag 19. okt","Mandag","19. okt","2020-10-19","2021-10-19"]
[null,null,null,null,null,null,null,null,null,null,null,null,"Onsdag 21. okt","Onsdag 21. okt","Onsdag","21. okt","2020-10-21","2021-10-21"]
[null,null,null,null,null,null,null,null,null,null,null,null,"Onsdag 21. okt","Onsdag 21. okt","Onsdag","21. okt","2020-10-21","2021-10-21"]
[null,null,null,null,null,null,null,null,null,null,null,null,"Torsdag 22. okt","Torsdag 22. okt","Torsdag","22. okt","2020-10-22","2021-10-22"]
[null,null,null,null,null,null,null,null,null,null,null,null,"Onsdag 28. okt","Onsdag 28. okt","Onsdag","28. okt","2020-10-28","2021-10-28"]
[null,null,null,null,null,null,null,null,null,null,null,null,"Torsdag 5. nov","Torsdag 5. nov","Torsdag","5. nov","2020-11-05","2021-11-05"]
[null,null,null,null,null,null,null,null,null,null,null,null,"Mandag 9. nov","Mandag 9. nov","Mandag","9. nov","2020-11-09","2021-11-09"]
[null,null,null,null,null,null,null,null,null,null,null,null,"Torsdag 12. nov","Torsdag 12. nov","Torsdag","12. nov","2020-11-12","2021-11-12"]
[null,null,null,null,null,null,null,null,null,null,null,null,"Torsdag 19. nov","Torsdag 19. nov","Torsdag","19. nov","2020-11-19","2021-11-19"]
[null,null,null,null,null,null,null,null,null,null,null,null,"Torsdag 19. nov","Torsdag 19. nov","Torsdag","19. nov","2020-11-19","2021-11-19"]
[null,null,null,null,null,null,null,null,null,null,null,null,"Fredag 20. nov","Fredag 20. nov","Fredag","20. nov","2020-11-20","2021-11-20"]
[null,null,null,null,null,null,null,null,null,null,null,null,"Fredag 20. nov","Fredag 20. nov","Fredag","20. nov","2020-11-20","2021-11-20"]
[null,null,null,null,null,null,null,null,null,null,null,null,"Torsdag 26. nov","Torsdag 26. nov","Torsdag","26. nov","2020-11-26","2021-11-26"]
[null,null,null,null,null,null,null,null,null,null,null,null,"Fredag 4. des","Fredag 4. des","Fredag","4. des","2020-12-04","2021-12-04"]
[null,null,null,null,null,null,null,null,null,null,null,null,"Onsdag 9. des","Onsdag 9. des","Onsdag","9. des","2020-12-09","2021-12-09"]
[null,null,null,null,null,null,null,null,null,null,null,null,"Fredag 11. des","Fredag 11. des","Fredag","11. des","2020-12-11","2021-12-11"]
[null,null,null,null,null,null,null,null,null,null,null,null,"Torsdag 10. des","Torsdag 10. des","Torsdag","10. des","2020-12-10","2021-12-10"]
[null,null,null,null,null,null,null,null,null,null,null,null,"Fredag 18. des","Fredag 18. des","Fredag","18. des","2020-12-18","2021-12-18"]
[null,null,null,null,null,null,null,null,null,null,null,null,"Fredag 18.12","Fredag 18.12","Fredag","18.12","2020-12-18","2021-12-18"]